BDBM50127990 5-tert-Butyl-1-(4-fluoro-phenyl)-1H-indole::CHEMBL299590
SMILES CC(C)(C)c1ccc2n(ccc2c1)-c1ccc(F)cc1
InChI Key InChIKey=LKTSQUIZGWIGAG-UHFFFAOYSA-N
Data  2 IC50
  Tab Delimited (TSV)   2D SDfile   Computed 3D by Vconf -m prep SDfile
Find this compound or compounds like it in BindingDB:
Activity Spreadsheet -- Enzyme Inhibition Constant Data from BindingDB
Found 2 hits for monomerid = 50127990
TargetPotassium voltage-gated channel subfamily H member 2(Homo sapiens (Human))
Aventis Pharmaceuticals
Curated by ChEMBL
LigandPNGBDBM50127990(5-tert-Butyl-1-(4-fluoro-phenyl)-1H-indole | CHEMB...)
Affinity DataIC50: >1.00E+4nM. Assay description: Inhibition of K+ channel activity in CHO cells expressing HERG Kv11.1
In DepthDetails ArticlePubMed
TargetPotassium voltage-gated channel subfamily H member 2(Homo sapiens (Human))
Aventis Pharmaceuticals
Curated by ChEMBL
LigandPNGBDBM50127990(5-tert-Butyl-1-(4-fluoro-phenyl)-1H-indole | CHEMB...)
Affinity DataIC50:  1.00E+4nM. Assay description: Inhibition of human ERG
In DepthDetails ArticlePubMed