BDBM50127995 1-[5-Chloro-1-(4-fluoro-phenyl)-1H-indol-3-yl]-ethanone::CHEMBL301992
SMILES CC(=O)c1cn(-c2ccc(F)cc2)c2ccc(Cl)cc12
InChI Key InChIKey=SWPRXXOOLHFIKF-UHFFFAOYSA-N
Data  2 IC50
  Tab Delimited (TSV)   2D SDfile   Computed 3D by Vconf -m prep SDfile
Find this compound or compounds like it in BindingDB:
Activity Spreadsheet -- Enzyme Inhibition Constant Data from BindingDB
Found 2 hits for monomerid = 50127995
TargetPotassium voltage-gated channel subfamily H member 2(Homo sapiens (Human))
Aventis Pharmaceuticals
Curated by ChEMBL
LigandPNGBDBM50127995(1-[5-Chloro-1-(4-fluoro-phenyl)-1H-indol-3-yl]-eth...)
Affinity DataIC50: >1.00E+4nM. Assay description: Inhibition of K+ channel activity in CHO cells expressing HERG Kv11.1
In DepthDetails ArticlePubMed
TargetPotassium voltage-gated channel subfamily H member 2(Homo sapiens (Human))
Aventis Pharmaceuticals
Curated by ChEMBL
LigandPNGBDBM50127995(1-[5-Chloro-1-(4-fluoro-phenyl)-1H-indol-3-yl]-eth...)
Affinity DataIC50:  1.00E+4nM. Assay description: Inhibition of human ERG
In DepthDetails ArticlePubMed