BDBM50127998 1-[5-Chloro-1-(4-fluoro-phenyl)-1H-indol-3-yl]-propan-1-ol::CHEMBL53866
SMILES CCC(O)c1cn(-c2ccc(F)cc2)c2ccc(Cl)cc12
InChI Key InChIKey=PZFVISYBXMCPDS-UHFFFAOYSA-N
Data  2 IC50
  Tab Delimited (TSV)   2D SDfile   Computed 3D by Vconf -m prep SDfile
Find this compound or compounds like it in BindingDB:
Activity Spreadsheet -- Enzyme Inhibition Constant Data from BindingDB
Found 2 hits for monomerid = 50127998
TargetPotassium voltage-gated channel subfamily H member 2(Homo sapiens (Human))
Aventis Pharmaceuticals
Curated by ChEMBL
LigandPNGBDBM50127998(1-[5-Chloro-1-(4-fluoro-phenyl)-1H-indol-3-yl]-pro...)
Affinity DataIC50:  2.20E+3nM. Assay description: Inhibition of K+ channel activity in CHO cells expressing HERG Kv11.1
In DepthDetails ArticlePubMed
TargetPotassium voltage-gated channel subfamily H member 2(Homo sapiens (Human))
Aventis Pharmaceuticals
Curated by ChEMBL
LigandPNGBDBM50127998(1-[5-Chloro-1-(4-fluoro-phenyl)-1H-indol-3-yl]-pro...)
Affinity DataIC50:  2.19E+6nM. Assay description: Inhibition of human ERG
In DepthDetails ArticlePubMed