BDBM50128000 CHEMBL415944::[4-(5-Chloro-3-{1-[2-(2-oxo-imidazolidin-1-yl)-ethyl]-piperidin-4-yl}-indol-1-yl)-phenyl]-acetic acid methyl ester
SMILES COC(=O)Cc1ccc(cc1)-n1cc(C2CCN(CCN3CCNC3=O)CC2)c2cc(Cl)ccc12
InChI Key InChIKey=IKIDYUZRZURTHB-UHFFFAOYSA-N
Data  2 IC50
  Tab Delimited (TSV)   2D SDfile   Computed 3D by Vconf -m prep SDfile
Find this compound or compounds like it in BindingDB:
Activity Spreadsheet -- Enzyme Inhibition Constant Data from BindingDB
Found 2 hits for monomerid = 50128000
TargetPotassium voltage-gated channel subfamily H member 2(Homo sapiens (Human))
Aventis Pharmaceuticals
Curated by ChEMBL
LigandPNGBDBM50128000(CHEMBL415944 | [4-(5-Chloro-3-{1-[2-(2-oxo-imidazo...)
Affinity DataIC50:  131nM. Assay description: Inhibition of K+ channel activity in CHO cells expressing HERG Kv11.1
In DepthDetails ArticlePubMed
TargetPotassium voltage-gated channel subfamily H member 2(Homo sapiens (Human))
Aventis Pharmaceuticals
Curated by ChEMBL
LigandPNGBDBM50128000(CHEMBL415944 | [4-(5-Chloro-3-{1-[2-(2-oxo-imidazo...)
Affinity DataIC50:  132nM. Assay description: Inhibition of human ERG
In DepthDetails ArticlePubMed