BDBM50128092 7-Methoxy-1-(2-morpholin-4-yl-ethyl)-1H-indazole-3-carboxylic acid (1,3,3-trimethyl-bicyclo[2.2.1]hept-2-yl)-amide::CHEMBL294591
SMILES COc1cccc2c(nn(CCN3CCOCC3)c12)C(=O)NC1[C@@]2(C)CC[C@H](C2)C1(C)C
InChI Key InChIKey=CPTXZVAIZCMESQ-QFSZVTIDSA-N
Data  2 KI
  Tab Delimited (TSV)   2D SDfile   Computed 3D by Vconf -m prep SDfile
Find this compound or compounds like it in BindingDB:
Activity Spreadsheet -- Enzyme Inhibition Constant Data from BindingDB
Found 2 hits for monomerid = 50128092
TargetCannabinoid receptor 2(Homo sapiens (Human))
Bristol-Myers Squibb
Curated by ChEMBL
LigandPNGBDBM50128092(7-Methoxy-1-(2-morpholin-4-yl-ethyl)-1H-indazole-3...)
Affinity DataKi:  2nM. Assay description: Binding affinity against human cannabinoid receptor 2 in chinese hamster ovary cells using WIN-55212-2 mesylate[57-3H]
In DepthDetails ArticlePubMed
TargetCannabinoid receptor 1(Homo sapiens (Human))
Bristol-Myers Squibb
Curated by ChEMBL
LigandPNGBDBM50128092(7-Methoxy-1-(2-morpholin-4-yl-ethyl)-1H-indazole-3...)
Affinity DataKi:  24nM. Assay description: Binding affinity of compound against human cannabinoid receptor 1 in chinese hamster ovary cells by using radioligand CP-55940
In DepthDetails ArticlePubMed