BDBM50130028 7-(4-Amino-phenyl)-8-oxo-2-(pyridin-2-ylmethoxy)-5-(3,4,5-trimethoxy-phenyl)-7,8-dihydro-[1,7]naphthyridine-6-carboxylic acid methyl ester with 2moles of hydrochloride::CHEMBL553729
SMILES COC(=O)c1c(-c2cc(OC)c(OC)c(OC)c2)c2ccc(OCc3ccccn3)nc2c(=O)n1-c1ccc(N)cc1
InChI Key InChIKey=SWPGANDJPMZVFG-UHFFFAOYSA-N
Data  3 IC50
  Tab Delimited (TSV)   2D SDfile   Computed 3D by Vconf -m prep SDfile
Find this compound or compounds like it in BindingDB:
Activity Spreadsheet -- Enzyme Inhibition Constant Data from BindingDB
Found 3 hits for monomerid = 50130028
TargetcGMP-specific 3',5'-cyclic phosphodiesterase(Canis lupus familiaris)
Tanabe Seiyaku
Curated by ChEMBL
LigandPNGBDBM50130028(7-(4-Amino-phenyl)-8-oxo-2-(pyridin-2-ylmethoxy)-5...)
Affinity DataIC50:  0.510nM. Assay description: Inhibitory activity against phosphodiesterase 5 (PDE5) isolated from canine lung
In DepthDetails ArticlePubMed
TargetP04972/P11541/P16586/P22571/P23439/Q95142(Bos taurus)
Tanabe Seiyaku
Curated by ChEMBL
LigandPNGBDBM50130028(7-(4-Amino-phenyl)-8-oxo-2-(pyridin-2-ylmethoxy)-5...)
Affinity DataIC50:  22nM. Assay description: Inhibitory activity against Phosphodiesterase 6 isolated from bovine retina
In DepthDetails ArticlePubMed
LigandPNGBDBM50130028(7-(4-Amino-phenyl)-8-oxo-2-(pyridin-2-ylmethoxy)-5...)
Affinity DataIC50:  4.00E+4nM. Assay description: Inhibitory activity against phosphodiesterase-1 (PDE1) isolated from canine lung
In DepthDetails ArticlePubMed