BDBM50130902 CHEMBL3632949
SMILES [H][C@]12C[C@@]3(C)C(C=C[C@@]4([H])[C@@]5(C)CCC(=O)C(C)(C)[C@]5([H])CC[C@]34C)=C1[C@H](C)CC(=O)[C@H](O2)C(C)(C)O
InChI Key InChIKey=TZUCUQTWDXYCLJ-WXECSZRISA-N
Data  1 IC50  1 EC50
  Tab Delimited (TSV)   2D SDfile   Computed 3D by Vconf -m prep SDfile
Find this compound or compounds like it in BindingDB:
Activity Spreadsheet -- Enzyme Inhibition Constant Data from BindingDB
Found 2 hits for monomerid = 50130902
TargetBile acid receptor(Homo sapiens (Human))
Dalian Medical University
Curated by ChEMBL
LigandPNGBDBM50130902(CHEMBL3632949)
Affinity DataEC50:  1.04E+4nM. Assay description: Transactivation of FXR (unknown origin) transfected in HepG2 cells co-expressing pBSEP/pGL4.74 incubated for 24 hrs by luciferase reporter gene assay
In DepthDetails ArticlePubMed
TargetCocaine esterase(Homo sapiens (Human))
Liaoning University Of Traditional Chinese Medicine
Curated by ChEMBL
LigandPNGBDBM50130902(CHEMBL3632949)
Affinity DataIC50:  5.88E+4nM. Assay description: Inhibition of human carboxylesterase 2 using 4-benzoyl-N-butyl-1,8-naphthalimide as substrate by fluorescence assay
In DepthDetails ArticlePubMed