BDBM50130907 ALISOL A
SMILES [H][C@@]12CC[C@@]3(C)[C@@]([H])([C@@H](O)CC4=C(CC[C@]34C)[C@H](C)C[C@H](O)[C@@H](O)C(C)(C)O)[C@@]1(C)CCC(=O)C2(C)C
InChI Key InChIKey=HNOSJVWYGXOFRP-UNPOXIGHSA-N
Data  1 IC50  1 EC50
  Tab Delimited (TSV)   2D SDfile   Computed 3D by Vconf -m prep SDfile
Find this compound or compounds like it in BindingDB:
Activity Spreadsheet -- Enzyme Inhibition Constant Data from BindingDB
Found 2 hits for monomerid = 50130907
TargetBile acid receptor(Homo sapiens (Human))
Dalian Medical University
Curated by ChEMBL
LigandPNGBDBM50130907(ALISOL A)
Affinity DataEC50:  1.02E+4nM. Assay description: Transactivation of FXR (unknown origin) transfected in HepG2 cells co-expressing pBSEP/pGL4.74 incubated for 24 hrs by luciferase reporter gene assay
In DepthDetails ArticlePubMed
TargetCocaine esterase(Homo sapiens (Human))
Liaoning University Of Traditional Chinese Medicine
Curated by ChEMBL
LigandPNGBDBM50130907(ALISOL A)
Affinity DataIC50:  1.00E+5nM. Assay description: Inhibition of human carboxylesterase 2 using 4-benzoyl-N-butyl-1,8-naphthalimide as substrate by fluorescence assay
In DepthDetails ArticlePubMed