BDBM50130910 CHEMBL3632955
SMILES [H][C@]12C[C@@]3(C)C(C[C@H](O)[C@@]4([H])[C@@]5(C)CCC(=O)C(C)(C)[C@]5([H])CC[C@]34C)=C1[C@H](C)C[C@H](OC(C)=O)[C@H](O2)C(C)(C)O
InChI Key InChIKey=QJQGTCCCAJRIPR-QRPPABIJSA-N
Data  1 IC50
  Tab Delimited (TSV)   2D SDfile   Computed 3D by Vconf -m prep SDfile
Find this compound or compounds like it in BindingDB:
Activity Spreadsheet -- Enzyme Inhibition Constant Data from BindingDB
Found 1 hit for monomerid = 50130910
TargetCocaine esterase(Homo sapiens (Human))
Liaoning University Of Traditional Chinese Medicine
Curated by ChEMBL
LigandPNGBDBM50130910(CHEMBL3632955)
Affinity DataIC50:  4.11E+4nM. Assay description: Inhibition of human carboxylesterase 2 using 4-benzoyl-N-butyl-1,8-naphthalimide as substrate by fluorescence assay
In DepthDetails ArticlePubMed