BDBM50130914 CHEMBL3632959
SMILES [H][C@@]12CC3=C(CC[C@]3(C)[C@@]3(C)CC[C@@]([H])(C(C)(C)C(O)=O)[C@](C)(CC(=O)O1)[C@]23[H])[C@H](C)C[C@H](O)[C@@H](O)C(C)(C)O
InChI Key InChIKey=KKXUNIAWSGXCIU-BFUVOVAVSA-N
Data  1 IC50
  Tab Delimited (TSV)   2D SDfile   Computed 3D by Vconf -m prep SDfile
Find this compound or compounds like it in BindingDB:
Activity Spreadsheet -- Enzyme Inhibition Constant Data from BindingDB
Found 1 hit for monomerid = 50130914
TargetCocaine esterase(Homo sapiens (Human))
Liaoning University Of Traditional Chinese Medicine
Curated by ChEMBL
LigandPNGBDBM50130914(CHEMBL3632959)
Affinity DataIC50:  2.09E+4nM. Assay description: Inhibition of human carboxylesterase 2 using 4-benzoyl-N-butyl-1,8-naphthalimide as substrate by fluorescence assay
In DepthDetails ArticlePubMed