BDBM50131192 2-Benzyl-5-(2-bromo-phenyl)-2H-[1,2,4]triazole-3-thiol::CHEMBL313556
SMILES Brc1ccccc1-c1nn(Cc2ccccc2)c(=S)[nH]1
InChI Key InChIKey=FKZLBZDXOZJIIY-UHFFFAOYSA-N
Data  1 IC50
  Tab Delimited (TSV)   2D SDfile   Computed 3D by Vconf -m prep SDfile
Find this compound or compounds like it in BindingDB:
Activity Spreadsheet -- Enzyme Inhibition Constant Data from BindingDB
Found 1 hit for monomerid = 50131192
TargetC-X-C chemokine receptor type 2(Homo sapiens (Human))
Astrazeneca R&D Charnwood
Curated by ChEMBL
LigandPNGBDBM50131192(2-Benzyl-5-(2-bromo-phenyl)-2H-[1,2,4]triazole-3-t...)
Affinity DataIC50:  350nM. Assay description: Inhibition of binding of [125I]-IL8 to human recombinant CXC chemokine receptor 2 (CXCR2) expressed in HEK 293 membranes
In DepthDetails ArticlePubMed