BDBM50134072 (4-{(4-Bromo-phenyl)-[(E)-methoxyimino]-methyl}-4'-methyl-[1,4']bipiperidinyl-1'-yl)-(2,4-dimethyl-pyridin-3-yl)-methanone::CHEMBL139559
SMILES CO\N=C(/C1CCN(CC1)C1(C)CCN(CC1)C(=O)c1c(C)ccnc1C)c1ccc(Br)cc1
InChI Key InChIKey=YZDKZEBRKKYLLA-JVCXMKTPSA-N
Data  1 KI
  Tab Delimited (TSV)   2D SDfile   Computed 3D by Vconf -m prep SDfile
Find this compound or compounds like it in BindingDB:
Activity Spreadsheet -- Enzyme Inhibition Constant Data from BindingDB
Found 1 hit for monomerid = 50134072
TargetC-C chemokine receptor type 5(Homo sapiens (Human))
Lindsley F. Kimball Research Institute
Curated by ChEMBL
LigandPNGBDBM50134072((4-{(4-Bromo-phenyl)-[(E)-methoxyimino]-methyl}-4'...)
Affinity DataKi:  1.10nM. Assay description: Inhibition of RANTES binding to the human C-C chemokine receptor type 5 (CCR5)
In DepthDetails ArticlePubMed