BDBM50136321 2,3-Bis-(3,4-dihydroxy-phenyl)-succinic acid::CHEMBL422992
SMILES OC(=O)C(C(C(O)=O)c1ccc(O)c(O)c1)c1ccc(O)c(O)c1
InChI Key InChIKey=UMAASMUXEBOCLH-UHFFFAOYSA-N
Data  1 IC50
  Tab Delimited (TSV)   2D SDfile   Computed 3D by Vconf -m prep SDfile
Find this compound or compounds like it in BindingDB:
Activity Spreadsheet -- Enzyme Inhibition Constant Data from BindingDB
Found 1 hit for monomerid = 50136321
TargetIntegrase(Human immunodeficiency virus 1)
Institute Of Science & Technology
Curated by ChEMBL
LigandPNGBDBM50136321(2,3-Bis-(3,4-dihydroxy-phenyl)-succinic acid | CHE...)
Affinity DataIC50:  2.36E+4nM. Assay description: Inhibitory activity against HIV-1 integrase
In DepthDetails ArticlePubMed