BDBM50137693 CHEMBL81037::{(S)-1-[(S)-1-((2S,4S)-1-Benzyl-2-hydroxy-4-{(R)-2-methyl-1-[(pyridin-4-ylmethyl)-carbamoyl]-propylcarbamoyl}-pentylcarbamoyl)-3-methylsulfanyl-propylcarbamoyl]-butyl}-carbamic acid tert-butyl ester
SMILES CCC[C@H](NC(=O)OC(C)(C)C)C(=O)N[C@@H](CCSC)C(=O)N[C@@H](Cc1ccccc1)[C@@H](O)C[C@@H](C)C(=O)N[C@@H](C(C)C)C(=O)NCc1ccncc1
InChI Key InChIKey=VVUJHZKOIHQORZ-VCDNNQQPSA-N
Data  1 IC50
  Tab Delimited (TSV)   2D SDfile   Computed 3D by Vconf -m prep SDfile
Find this compound or compounds like it in BindingDB:
Activity Spreadsheet -- Enzyme Inhibition Constant Data from BindingDB
Found 1 hit for monomerid = 50137693
TargetBeta-secretase 1(Homo sapiens (Human))
Eli Lilly
Curated by ChEMBL
LigandPNGBDBM50137693(CHEMBL81037 | {(S)-1-[(S)-1-((2S,4S)-1-Benzyl-2-hy...)
Affinity DataIC50:  60nM. Assay description: In vitro inhibition of Beta-secretase-1 in HEK293 (Human Embryonic Kidney) cell line.
In DepthDetails ArticlePubMed