BDBM50139115 4-Sulfamoyloxy-benzoic acid cyclopentyl ester::CHEMBL347202
SMILES NS(=O)(=O)Oc1ccc(cc1)C(=O)OC1CCCC1
InChI Key InChIKey=UOISMBVIIRRGNN-UHFFFAOYSA-N
Data  1 IC50
  Tab Delimited (TSV)   2D SDfile   Computed 3D by Vconf -m prep SDfile
Find this compound or compounds like it in BindingDB:
Activity Spreadsheet -- Enzyme Inhibition Constant Data from BindingDB
Found 1 hit for monomerid = 50139115
TargetSteryl-sulfatase(Homo sapiens (Human))
Kingston University
Curated by ChEMBL
LigandPNGBDBM50139115(4-Sulfamoyloxy-benzoic acid cyclopentyl ester | CH...)
Affinity DataIC50:  9.30E+3nM. Assay description: Inhibition of estrone sulfatase
In DepthDetails ArticlePubMed