BDBM50140132 CHEMBL3752943
SMILES N[C@@H](CCN(Cc1ccccc1Oc1ccc(Cl)cc1)Cc1ccccc1Oc1ccc(Cl)cc1)C(O)=O
InChI Key InChIKey=UOCICUPZUHGXCB-MHZLTWQESA-N
Data  2 IC50
  Tab Delimited (TSV)   2D SDfile   Computed 3D by Vconf -m prep SDfile
Find this compound or compounds like it in BindingDB:
Activity Spreadsheet -- Enzyme Inhibition Constant Data from BindingDB
Found 2 hits for monomerid = 50140132
TargetNeutral amino acid transporter B(0)(Homo sapiens (Human))
Vanderbilt University Medical Center
Curated by ChEMBL
LigandPNGBDBM50140132(CHEMBL3752943)
Affinity DataIC50:  2.60E+4nM. Assay description: Inhibition of ASCT2-mediated glutamine transport in human HEK293 cells using [3H]-glutamine after 15 mins by scintillation counting
In DepthDetails ArticlePubMed
TargetAmino acid transporter(Rattus norvegicus)
Vanderbilt University Medical Center
Curated by ChEMBL
LigandPNGBDBM50140132(CHEMBL3752943)
Affinity DataIC50:  2.43E+4nM. Assay description: Inhibition of ASCT2-mediated glutamine transport in rat C6 cells using [3H]-glutamine after 15 mins by scintillation counting
In DepthDetails ArticlePubMed