BDBM50140134 CHEMBL3753869
SMILES COc1cccc(Oc2ccccc2CN(CC[C@H](N)C(O)=O)Cc2ccccc2Oc2cccc(OC)c2)c1
InChI Key InChIKey=HONXILKYOFNTMF-LJAQVGFWSA-N
Data  2 IC50
  Tab Delimited (TSV)   2D SDfile   Computed 3D by Vconf -m prep SDfile
Find this compound or compounds like it in BindingDB:
Activity Spreadsheet -- Enzyme Inhibition Constant Data from BindingDB
Found 2 hits for monomerid = 50140134
TargetNeutral amino acid transporter B(0)(Homo sapiens (Human))
Vanderbilt University Medical Center
Curated by ChEMBL
LigandPNGBDBM50140134(CHEMBL3753869)
Affinity DataIC50:  5.72E+4nM. Assay description: Inhibition of ASCT2-mediated glutamine transport in human HEK293 cells using [3H]-glutamine after 15 mins by scintillation counting
In DepthDetails ArticlePubMed
TargetAmino acid transporter(Rattus norvegicus)
Vanderbilt University Medical Center
Curated by ChEMBL
LigandPNGBDBM50140134(CHEMBL3753869)
Affinity DataIC50:  1.30E+3nM. Assay description: Inhibition of ASCT2-mediated glutamine transport in rat C6 cells using [3H]-glutamine after 15 mins by scintillation counting
In DepthDetails ArticlePubMed