BDBM50140147 2-{4-[5-(4-Methoxy-phenyl)-thiazol-2-yl]-benzenesulfonylamino}-pentanedioic acid::CHEMBL13965
SMILES COc1ccc(cc1)-c1cnc(s1)-c1ccc(cc1)S(=O)(=O)NC(CCC(O)=O)C(O)=O
InChI Key InChIKey=BDLOAWYPUGHWAJ-UHFFFAOYSA-N
Data  2 IC50
  Tab Delimited (TSV)   2D SDfile   Computed 3D by Vconf -m prep SDfile
Find this compound or compounds like it in BindingDB:
Activity Spreadsheet -- Enzyme Inhibition Constant Data from BindingDB
Found 2 hits for monomerid = 50140147
TargetMatrix metalloproteinase-9(Homo sapiens (Human))
Universit£
Curated by ChEMBL
LigandPNGBDBM50140147(2-{4-[5-(4-Methoxy-phenyl)-thiazol-2-yl]-benzenesu...)
Affinity DataIC50:  50nM. Assay description: Inhibition of matrix metalloprotease-9
In DepthDetails ArticlePubMed
Target72 kDa type IV collagenase(Homo sapiens (Human))
Universit£
Curated by ChEMBL
LigandPNGBDBM50140147(2-{4-[5-(4-Methoxy-phenyl)-thiazol-2-yl]-benzenesu...)
Affinity DataIC50:  50nM. Assay description: Inhibition of matrix metalloprotease-2
In DepthDetails ArticlePubMed