BDBM50140785 2-Methylaminomethyl-4-phenyl-quinoline-3-carboxylic acid 3,5-bis-trifluoromethyl-benzylamide::CHEMBL26761
SMILES CNCc1nc2ccccc2c(-c2ccccc2)c1C(=O)NCc1cc(cc(c1)C(F)(F)F)C(F)(F)F
InChI Key InChIKey=KUPDICLCUUMCDF-UHFFFAOYSA-N
Data  1 IC50
  Tab Delimited (TSV)   2D SDfile   Computed 3D by Vconf -m prep SDfile
Find this compound or compounds like it in BindingDB:
Activity Spreadsheet -- Enzyme Inhibition Constant Data from BindingDB
Found 1 hit for monomerid = 50140785
TargetSubstance-P receptor(Homo sapiens (Human))
Università
Curated by ChEMBL
LigandPNGBDBM50140785(2-Methylaminomethyl-4-phenyl-quinoline-3-carboxyli...)
Affinity DataIC50:  0.0110nM. Assay description: Binding affinity against human Tachykinin receptor 1 expressed in astrocytoma UC11MG cells using [125I]- SP radioligand
In DepthDetails ArticlePubMed