BDBM50140788 2-Aminomethyl-4-phenyl-quinoline-3-carboxylic acid (3,5-bis-trifluoromethyl-benzyl)-methyl-amide::CHEMBL25521
SMILES CN(Cc1cc(cc(c1)C(F)(F)F)C(F)(F)F)C(=O)c1c(CN)nc2ccccc2c1-c1ccccc1
InChI Key InChIKey=BQDJZPXUORQZMS-UHFFFAOYSA-N
Data  1 IC50
  Tab Delimited (TSV)   2D SDfile   Computed 3D by Vconf -m prep SDfile
Find this compound or compounds like it in BindingDB:
Activity Spreadsheet -- Enzyme Inhibition Constant Data from BindingDB
Found 1 hit for monomerid = 50140788
TargetSubstance-P receptor(Homo sapiens (Human))
Università
Curated by ChEMBL
LigandPNGBDBM50140788(2-Aminomethyl-4-phenyl-quinoline-3-carboxylic acid...)
Affinity DataIC50:  9nM. Assay description: Binding affinity against human Tachykinin receptor 1 expressed in astrocytoma UC11MG cells using [125I]- SP radioligand
In DepthDetails ArticlePubMed