BDBM50144121 CHEMBL66362::[4-(6-Chloro-benzo[b]thiophene-2-sulfonyl)-piperazin-1-yl]-[4-(imino-pyrrolidin-1-yl-methyl)-phenyl]-methanone
SMILES Clc1ccc2cc(sc2c1)S(=O)(=O)N1CCN(CC1)C(=O)c1ccc(cc1)C(=N)N1CCCC1
InChI Key InChIKey=RKWPCWLZTAQWDI-UHFFFAOYSA-N
Data  1 IC50
  Tab Delimited (TSV)   2D SDfile   Computed 3D by Vconf -m prep SDfile
Find this compound or compounds like it in BindingDB:
Activity Spreadsheet -- Enzyme Inhibition Constant Data from BindingDB
Found 1 hit for monomerid = 50144121
TargetCoagulation factor X(Homo sapiens (Human))
Millennium Pharmaceuticals
Curated by ChEMBL
LigandPNGBDBM50144121(CHEMBL66362 | [4-(6-Chloro-benzo[b]thiophene-2-sul...)
Affinity DataIC50:  70nM. Assay description: In vitro inhibitory activity against Coagulation factor X was determined
In DepthDetails ArticlePubMed