BDBM50144704 CHEMBL74188::N*2*-(4-Bromo-phenyl)-6-(5-chloro-2-methoxy-phenyl)-pyrimidine-2,4-diamine
SMILES COc1ccc(Cl)cc1-c1cc(N)nc(Nc2ccc(Br)cc2)n1
InChI Key InChIKey=MDMGROFXZGIDQC-UHFFFAOYSA-N
Data  1 IC50
  Tab Delimited (TSV)   2D SDfile   Computed 3D by Vconf -m prep SDfile
Find this compound or compounds like it in BindingDB:
Activity Spreadsheet -- Enzyme Inhibition Constant Data from BindingDB
Found 1 hit for monomerid = 50144704
Target1-acyl-sn-glycerol-3-phosphate acyltransferase beta(Homo sapiens (Human))
Cell Therapeutics
Curated by ChEMBL
LigandPNGBDBM50144704(CHEMBL74188 | N*2*-(4-Bromo-phenyl)-6-(5-chloro-2-...)
Affinity DataIC50:  2.30E+3nM. Assay description: Inhibitory activity against Lysophosphatidic acid acyltransferase-beta expressed in Sf9 insect cell membranes
In DepthDetails ArticlePubMed