BDBM50144896 CHEMBL3763179
SMILES CON(C)C(=O)\C=C\c1ccc(cc1)C(=O)NCc1ccccc1C(F)(F)F
InChI Key InChIKey=NKZYJXDKRJKKNX-FMIVXFBMSA-N
Data  1 IC50
  Tab Delimited (TSV)   2D SDfile   Computed 3D by Vconf -m prep SDfile
Find this compound or compounds like it in BindingDB:
Activity Spreadsheet -- Enzyme Inhibition Constant Data from BindingDB
Found 1 hit for monomerid = 50144896
TargetBifunctional epoxide hydrolase 2(Homo sapiens (Human))
Goethe-University Frankfurt
Curated by ChEMBL
LigandPNGBDBM50144896(CHEMBL3763179)
Affinity DataIC50:  70nM. Assay description: Inhibition of human recombinant sEH using PHOME as substrate preincubated for 30 mins followed by substrate addition measured for 30 mins by fluoresc...
In DepthDetails ArticlePubMed