BDBM50144909 CHEMBL3763509
SMILES CCOC(=O)C(CC)Cc1ccc(cc1)C(=O)NCc1ccc(OC)cc1
InChI Key InChIKey=FDZDXLUVLSJIRY-UHFFFAOYSA-N
Data  1 IC50
  Tab Delimited (TSV)   2D SDfile   Computed 3D by Vconf -m prep SDfile
Find this compound or compounds like it in BindingDB:
Activity Spreadsheet -- Enzyme Inhibition Constant Data from BindingDB
Found 1 hit for monomerid = 50144909
TargetBifunctional epoxide hydrolase 2(Homo sapiens (Human))
Goethe-University Frankfurt
Curated by ChEMBL
LigandPNGBDBM50144909(CHEMBL3763509)
Affinity DataIC50:  620nM. Assay description: Inhibition of human recombinant sEH using PHOME as substrate preincubated for 30 mins followed by substrate addition measured for 30 mins by fluoresc...
In DepthDetails ArticlePubMed