BDBM50145733 1-(2,4-Dichloro-phenylamino)-1-(4-fluoro-2-methyl-phenyl)-4-pyridin-4-yl-butan-2-one::CHEMBL79576
SMILES Cc1cc(F)ccc1C(Nc1ccc(Cl)cc1Cl)C(=O)CCc1ccncc1
InChI Key InChIKey=MOFJKCQTXASYEE-UHFFFAOYSA-N
Data  1 KI
  Tab Delimited (TSV)   2D SDfile   Computed 3D by Vconf -m prep SDfile
Find this compound or compounds like it in BindingDB:
Activity Spreadsheet -- Enzyme Inhibition Constant Data from BindingDB
Found 1 hit for monomerid = 50145733
TargetCorticotropin-releasing factor receptor 1(Homo sapiens (Human))
Bristol-Myers Squibb Pharma Research Laboratories
Curated by ChEMBL
LigandPNGBDBM50145733(1-(2,4-Dichloro-phenylamino)-1-(4-fluoro-2-methyl-...)
Affinity DataKi:  512nM. Assay description: Binding affinity towards human corticotropin releasing factor (h-CRF1) receptor
In DepthDetails ArticlePubMed