BDBM50145737 2-(2-Bromo-phenyl)-2-(2-chloro-4-methyl-phenylamino)-1-(3-hydroxy-4-methoxy-phenyl)-ethanone::CHEMBL82707
SMILES COc1ccc(cc1O)C(=O)C(Nc1ccc(C)cc1Cl)c1ccccc1Br
InChI Key InChIKey=LKIMBIKDLMYJGK-UHFFFAOYSA-N
Data  1 KI
  Tab Delimited (TSV)   2D SDfile   Computed 3D by Vconf -m prep SDfile
Find this compound or compounds like it in BindingDB:
Activity Spreadsheet -- Enzyme Inhibition Constant Data from BindingDB
Found 1 hit for monomerid = 50145737
TargetCorticotropin-releasing factor receptor 1(Homo sapiens (Human))
Bristol-Myers Squibb Pharma Research Laboratories
Curated by ChEMBL
LigandPNGBDBM50145737(2-(2-Bromo-phenyl)-2-(2-chloro-4-methyl-phenylamin...)
Affinity DataKi:  1.07E+3nM. Assay description: Binding affinity towards human corticotropin releasing factor (h-CRF1) receptor
In DepthDetails ArticlePubMed