BDBM50145986 4-[4-(5,7-Dimethyl-2-propyl-imidazo[4,5-b]pyridin-3-ylmethyl)-phenyl]-3-(2H-tetrazol-5-yl)-quinoline::CHEMBL315387
SMILES CCCc1nc2c(C)cc(C)nc2n1Cc1ccc(cc1)-c1c(cnc2ccccc12)-c1nnn[nH]1
InChI Key InChIKey=NAVHJQODVJWWPY-UHFFFAOYSA-N
Data  1 IC50
  Tab Delimited (TSV)   2D SDfile   Computed 3D by Vconf -m prep SDfile
Find this compound or compounds like it in BindingDB:
Activity Spreadsheet -- Enzyme Inhibition Constant Data from BindingDB
Found 1 hit for monomerid = 50145986
TargetType-1 angiotensin II receptor B(RAT)
Università
Curated by ChEMBL
LigandPNGBDBM50145986(4-[4-(5,7-Dimethyl-2-propyl-imidazo[4,5-b]pyridin-...)
Affinity DataIC50:  12nM. Assay description: Binding affinity for rat angiotensin II receptor, type 1
In DepthDetails ArticlePubMed