BDBM50148558 CHEMBL3771369
SMILES CCOc1ccc(cc1NC(=O)c1cccc(c1)C(O)=O)C(=O)NC
InChI Key InChIKey=QVHILRBUZBDTKS-UHFFFAOYSA-N
Data  1 Kd
  Tab Delimited (TSV)   2D SDfile   Computed 3D by Vconf -m prep SDfile
Find this compound or compounds like it in BindingDB:
Activity Spreadsheet -- Enzyme Inhibition Constant Data from BindingDB
Found 1 hit for monomerid = 50148558
TargetCREB-binding protein(Homo sapiens (Human))
University Of Z£Rich
Curated by ChEMBL
LigandPNGBDBM50148558(CHEMBL3771369)
Affinity DataKd:  3.70E+4nM. Assay description: Competitive binding affinity to human His-tagged CREBBP expressed in T7 phage-infected Escherichia coli BL21(DE3) cells incubated for 1 hr by bromosc...
In DepthDetails ArticlePubMed