BDBM50148969 2-{2-[2-(5-Bromo-2-methoxy-phenyl)-ethyl]-3-chloro-phenyl}-1-ethyl-1H-imidazole::CHEMBL434029
SMILES CCn1ccnc1-c1cccc(Cl)c1CCc1cc(Br)ccc1OC
InChI Key InChIKey=DJNMKEGCGFTEIA-UHFFFAOYSA-N
Data  1 KI
  Tab Delimited (TSV)   2D SDfile   Computed 3D by Vconf -m prep SDfile
Find this compound or compounds like it in BindingDB:
Activity Spreadsheet -- Enzyme Inhibition Constant Data from BindingDB
Found 1 hit for monomerid = 50148969
TargetMelanocortin receptor 4(Homo sapiens (Human))
Millennium Pharmaceuticals
Curated by ChEMBL
LigandPNGBDBM50148969(2-{2-[2-(5-Bromo-2-methoxy-phenyl)-ethyl]-3-chloro...)
Affinity DataKi:  310nM. Assay description: In vitro binding affinity towards melanocortin 4 receptor.
In DepthDetails ArticlePubMed