BDBM50149672 CHEMBL184850::[3-(5-Dimethylamino-3-methyl-pyridin-2-yl)-2,5-dimethyl-pyrazolo[1,5-a]pyrimidin-7-yl]-dipropyl-amine
SMILES CCCN(CCC)c1cc(C)nc2c(c(C)nn12)-c1ncc(cc1C)N(C)C
InChI Key InChIKey=AVIYBZJGACSQAF-UHFFFAOYSA-N
Data  2 KI  2 IC50
  Tab Delimited (TSV)   2D SDfile   Computed 3D by Vconf -m prep SDfile
Find this compound or compounds like it in BindingDB:
Activity Spreadsheet -- Enzyme Inhibition Constant Data from BindingDB
Found 2 hits for monomerid = 50149672
TargetCorticotropin-releasing factor receptor 1(Homo sapiens (Human))
Neurocrine Biosciences
Curated by ChEMBL
LigandPNGBDBM50149672(CHEMBL184850 | [3-(5-Dimethylamino-3-methyl-pyridi...)
Affinity DataKi:  10nM. Assay description: Inhibition of [125I]-o-CRF binding to CHO cells expressing human CRF1 receptor
In DepthDetails ArticlePubMed
TargetCorticotropin-releasing factor receptor 1(Homo sapiens (Human))
Neurocrine Biosciences
Curated by ChEMBL
LigandPNGBDBM50149672(CHEMBL184850 | [3-(5-Dimethylamino-3-methyl-pyridi...)
Affinity DataKi:  10nM. Assay description: Binding affinity for recombinant human CRF1 receptor
In DepthDetails ArticlePubMed