BDBM50150311 CHEMBL183671::{5-[3-(3-Bromo-phenyl)-1H-pyrazolo[3,4-d]pyrimidin-4-ylethynyl]-pyridin-2-yl}-dimethyl-amine
SMILES CN(C)c1ccc(cn1)C#Cc1ncnc2n[nH]c(-c3cccc(Br)c3)c12
InChI Key InChIKey=RGEQZCFPJSLETF-UHFFFAOYSA-N
Data  1 IC50
  Tab Delimited (TSV)   2D SDfile   Computed 3D by Vconf -m prep SDfile
Find this compound or compounds like it in BindingDB:
Activity Spreadsheet -- Enzyme Inhibition Constant Data from BindingDB
Found 1 hit for monomerid = 50150311
TargetAdenosine kinase(Homo sapiens (Human))
Abbott Laboratories
Curated by ChEMBL
LigandPNGBDBM50150311(CHEMBL183671 | {5-[3-(3-Bromo-phenyl)-1H-pyrazolo[...)
Affinity DataIC50:  75nM. Assay description: In vitro inhibitory concentration against Adenosine kinase in cycstolic assay
In DepthDetails ArticlePubMed