BDBM50151498 CHEMBL3775682
SMILES Cc1cc(O)c2c(CC(O)=O)cc(=O)oc2c1
InChI Key InChIKey=MLEOHMMNTCSKQH-UHFFFAOYSA-N
Data  1 IC50
  Tab Delimited (TSV)   2D SDfile   Computed 3D by Vconf -m prep SDfile
Find this compound or compounds like it in BindingDB:
Activity Spreadsheet -- Enzyme Inhibition Constant Data from BindingDB
Found 1 hit for monomerid = 50151498
TargetLysine-specific demethylase 4C(Homo sapiens (Human))
University Of Oxford
Curated by ChEMBL
LigandPNGBDBM50151498(CHEMBL3775682)
Affinity DataIC50:  1.76E+5nM. Assay description: Inhibition of N-terminal His6-tagged KDM4C (1 to 352 residues) (unknown origin) expressed in Escherichia coli Rosetta 2(DE3)pLysS using biotinylated ...
In DepthDetails ArticlePubMed