BDBM50153823 CHEMBL184347::N-[2-Bromo-5-(3-dimethylamino-benzoylamino)-phenyl]-3,4-dimethoxy-benzamide
SMILES COc1ccc(cc1OC)C(=O)Nc1cc(NC(=O)c2cccc(c2)N(C)C)ccc1Br
InChI Key InChIKey=RMQIZEHVBNACLF-UHFFFAOYSA-N
Data  1 IC50
  Tab Delimited (TSV)   2D SDfile   Computed 3D by Vconf -m prep SDfile
Find this compound or compounds like it in BindingDB:
Activity Spreadsheet -- Enzyme Inhibition Constant Data from BindingDB
Found 1 hit for monomerid = 50153823
TargetMitogen-activated protein kinase 14(Homo sapiens (Human))
Astrazeneca
Curated by ChEMBL
LigandPNGBDBM50153823(CHEMBL184347 | N-[2-Bromo-5-(3-dimethylamino-benzo...)
Affinity DataIC50:  340nM. Assay description: Concentration required to inhibit human mitogen activated protein kinase p38 activity
In DepthDetails ArticlePubMed