BDBM50153827 1-(3-dimethylaminophenylcarboxamido)-3-[4-(2-ethoxyethoxy)phenylcarboxamido]-4-methylbenzene::CHEMBL185086
SMILES CCOCCOc1ccc(cc1)C(=O)Nc1cc(NC(=O)c2cccc(c2)N(C)C)ccc1C
InChI Key InChIKey=AJUCNMDMANVZHP-UHFFFAOYSA-N
Data  1 IC50
  Tab Delimited (TSV)   2D SDfile   Computed 3D by Vconf -m prep SDfile
Find this compound or compounds like it in BindingDB:
Activity Spreadsheet -- Enzyme Inhibition Constant Data from BindingDB
Found 1 hit for monomerid = 50153827
TargetMitogen-activated protein kinase 14(Homo sapiens (Human))
Astrazeneca
Curated by ChEMBL
LigandPNGBDBM50153827(1-(3-dimethylaminophenylcarboxamido)-3-[4-(2-ethox...)
Affinity DataIC50:  310nM. Assay description: Concentration required to inhibit human mitogen activated protein kinase p38 activity
In DepthDetails ArticlePubMed