BDBM50153828 4-methyl-1-[3-(1,4-oxazinan-4-yl)phenylcarboxamido]-3-[4-(3-pyridylmethoxy)phenylcarboxamido]benzene::CHEMBL182396
SMILES Cc1ccc(NC(=O)c2cccc(c2)N2CCOCC2)cc1NC(=O)c1ccc(OCc2cccnc2)cc1
InChI Key InChIKey=GPWGTKDTCOQZOX-UHFFFAOYSA-N
Data  1 IC50
  Tab Delimited (TSV)   2D SDfile   Computed 3D by Vconf -m prep SDfile
Find this compound or compounds like it in BindingDB:
Activity Spreadsheet -- Enzyme Inhibition Constant Data from BindingDB
Found 1 hit for monomerid = 50153828
TargetMitogen-activated protein kinase 14(Homo sapiens (Human))
Astrazeneca
Curated by ChEMBL
LigandPNGBDBM50153828(4-methyl-1-[3-(1,4-oxazinan-4-yl)phenylcarboxamido...)
Affinity DataIC50:  90nM. Assay description: Concentration required to inhibit human mitogen activated protein kinase p38 activity
In DepthDetails ArticlePubMed