BDBM50153832 3-Fluoro-N-{4-methyl-3-[4-(thiazol-4-ylmethoxy)-benzoylamino]-phenyl}-5-morpholin-4-yl-benzamide::CHEMBL184387
SMILES Cc1ccc(NC(=O)c2cc(F)cc(c2)N2CCOCC2)cc1NC(=O)c1ccc(OCc2cscn2)cc1
InChI Key InChIKey=GOXPCWOINCMRAX-UHFFFAOYSA-N
Data  1 IC50
  Tab Delimited (TSV)   2D SDfile   Computed 3D by Vconf -m prep SDfile
Find this compound or compounds like it in BindingDB:
Activity Spreadsheet -- Enzyme Inhibition Constant Data from BindingDB
Found 1 hit for monomerid = 50153832
TargetMitogen-activated protein kinase 14(Homo sapiens (Human))
Astrazeneca
Curated by ChEMBL
LigandPNGBDBM50153832(3-Fluoro-N-{4-methyl-3-[4-(thiazol-4-ylmethoxy)-be...)
Affinity DataIC50:  10nM. Assay description: Concentration required to inhibit human mitogen activated protein kinase p38 activity
In DepthDetails ArticlePubMed