BDBM50153837 1-(3-dimethylaminophenylcarboxamido)-3-(4-methoxyphenylcarboxamido)-4-methylbenzene::CHEMBL184011
SMILES COc1ccc(cc1)C(=O)Nc1cc(NC(=O)c2cccc(c2)N(C)C)ccc1C
InChI Key InChIKey=HDBXCACKAXIPCD-UHFFFAOYSA-N
Data  1 IC50
  Tab Delimited (TSV)   2D SDfile   Computed 3D by Vconf -m prep SDfile
Find this compound or compounds like it in BindingDB:
Activity Spreadsheet -- Enzyme Inhibition Constant Data from BindingDB
Found 1 hit for monomerid = 50153837
TargetMitogen-activated protein kinase 14(Homo sapiens (Human))
Astrazeneca
Curated by ChEMBL
LigandPNGBDBM50153837(1-(3-dimethylaminophenylcarboxamido)-3-(4-methoxyp...)
Affinity DataIC50:  180nM. Assay description: Concentration required to inhibit human mitogen activated protein kinase p38 activity
In DepthDetails ArticlePubMed