BDBM50153843 3-Fluoro-N-{4-methyl-3-[4-(pyridin-2-ylmethoxy)-benzoylamino]-phenyl}-5-morpholin-4-yl-benzamide::CHEMBL186531
SMILES Cc1ccc(NC(=O)c2cc(F)cc(c2)N2CCOCC2)cc1NC(=O)c1ccc(OCc2ccccn2)cc1
InChI Key InChIKey=ZAWXZFUSGKYODR-UHFFFAOYSA-N
Data  1 IC50
  Tab Delimited (TSV)   2D SDfile   Computed 3D by Vconf -m prep SDfile
Find this compound or compounds like it in BindingDB:
Activity Spreadsheet -- Enzyme Inhibition Constant Data from BindingDB
Found 1 hit for monomerid = 50153843
TargetMitogen-activated protein kinase 14(Homo sapiens (Human))
Astrazeneca
Curated by ChEMBL
LigandPNGBDBM50153843(3-Fluoro-N-{4-methyl-3-[4-(pyridin-2-ylmethoxy)-be...)
Affinity DataIC50:  60nM. Assay description: Concentration required to inhibit human mitogen activated protein kinase p38 activity
In DepthDetails ArticlePubMed