BDBM50153844 3-Fluoro-N-{4-methyl-3-[4-(2-methyl-thiazol-4-ylmethoxy)-benzoylamino]-phenyl}-5-morpholin-4-yl-benzamide::CHEMBL445920
SMILES Cc1nc(COc2ccc(cc2)C(=O)Nc2cc(NC(=O)c3cc(F)cc(c3)N3CCOCC3)ccc2C)cs1
InChI Key InChIKey=JIBSUUGGPMGDSH-UHFFFAOYSA-N
Data  1 IC50
  Tab Delimited (TSV)   2D SDfile   Computed 3D by Vconf -m prep SDfile
Find this compound or compounds like it in BindingDB:
Activity Spreadsheet -- Enzyme Inhibition Constant Data from BindingDB
Found 1 hit for monomerid = 50153844
TargetMitogen-activated protein kinase 14(Homo sapiens (Human))
Astrazeneca
Curated by ChEMBL
LigandPNGBDBM50153844(3-Fluoro-N-{4-methyl-3-[4-(2-methyl-thiazol-4-ylme...)
Affinity DataIC50:  90nM. Assay description: Concentration required to inhibit human mitogen activated protein kinase p38 activity
In DepthDetails ArticlePubMed