BDBM50153845 4-methyl-3-[4-(2-methyl-1,3-thiazol-4-ylmethoxy)phenylcarboxamido]-1-[3-(1,4-oxazinan-4-yl)phenylcarboxamido]benzene::CHEMBL264502
SMILES Cc1nc(COc2ccc(cc2)C(=O)Nc2cc(NC(=O)c3cccc(c3)N3CCOCC3)ccc2C)cs1
InChI Key InChIKey=YPRJRFRMPMLFEL-UHFFFAOYSA-N
Data  1 IC50
  Tab Delimited (TSV)   2D SDfile   Computed 3D by Vconf -m prep SDfile
Find this compound or compounds like it in BindingDB:
Activity Spreadsheet -- Enzyme Inhibition Constant Data from BindingDB
Found 1 hit for monomerid = 50153845
TargetMitogen-activated protein kinase 14(Homo sapiens (Human))
Astrazeneca
Curated by ChEMBL
LigandPNGBDBM50153845(4-methyl-3-[4-(2-methyl-1,3-thiazol-4-ylmethoxy)ph...)
Affinity DataIC50:  20nM. Assay description: Concentration required to inhibit human mitogen activated protein kinase p38 activity
In DepthDetails ArticlePubMed