BDBM50154519 CHEMBL3774626
SMILES C1CC(CCO1)[C@H]1N[C@H](Cc2c1[nH]c1ccccc21)c1nc(c[nH]1)-c1ccsc1
InChI Key InChIKey=GJXBTFZLJZMFBR-TZIWHRDSSA-N
Data  2 IC50  1 EC50
  Tab Delimited (TSV)   2D SDfile   Computed 3D by Vconf -m prep SDfile
Find this compound or compounds like it in BindingDB:
Activity Spreadsheet -- Enzyme Inhibition Constant Data from BindingDB
Found 3 hits for monomerid = 50154519
TargetPotassium voltage-gated channel subfamily H member 2(Homo sapiens (Human))
Merck Research Laboratories
Curated by ChEMBL
LigandPNGBDBM50154519(CHEMBL3774626)
Affinity DataIC50:  146nM. Assay description: Binding affinity to human ERG
In DepthDetails ArticlePubMed
TargetSomatostatin receptor type 3(Homo sapiens (Human))
Merck Research Laboratories
Curated by ChEMBL
LigandPNGBDBM50154519(CHEMBL3774626)
Affinity DataIC50:  15nM. Assay description: Binding affinity to human somatostatin receptor type 3
In DepthDetails ArticlePubMed
TargetSomatostatin receptor type 3(Homo sapiens (Human))
Merck Research Laboratories
Curated by ChEMBL
LigandPNGBDBM50154519(CHEMBL3774626)
Affinity DataEC50:  48nM. Assay description: Antagonist activity at human somatostatin receptor type 3 assessed as inhibition of cAMP levels
In DepthDetails ArticlePubMed