BDBM50154867 CHEMBL3775810::US10273244, Example 134::US10584135, Example 134
SMILES Cn1c(SCCCN2CC3CCN(C3C2)c2ccc(cc2)C(F)(F)F)nnc1-c1ccncn1
InChI Key InChIKey=IVXOADYRPYSQPC-UHFFFAOYSA-N
Data  6 KI  1 IC50
  Tab Delimited (TSV)   2D SDfile   Computed 3D by Vconf -m prep SDfile
Find this compound or compounds like it in BindingDB:
Activity Spreadsheet -- Enzyme Inhibition Constant Data from BindingDB
Found 4 hits for monomerid = 50154867
TargetD(3) dopamine receptor(Homo sapiens (Human))
Indivior
US Patent
LigandPNGBDBM50154867(CHEMBL3775810 | US10273244, Example 134 | US105841...)
Affinity DataKi:  1.32nM. Assay description: 3H]-Spiperone Binding Assay at hD3 and hD4 recombinant receptors CHO cells transiently transfected with human dopamine type 3 or 4 receptors (CHO-hD3...
In DepthDetails US Patent
TargetD(3) dopamine receptor(Homo sapiens (Human))
Indivior
US Patent
LigandPNGBDBM50154867(CHEMBL3775810 | US10273244, Example 134 | US105841...)
Affinity DataKi:  1.32nM. Assay description: [3H]-Spiperone Binding Assay at hD3 and hD4 recombinant receptors CHO cells transiently transfected with human dopamine type 3 or 4 receptors (CHO-hD...
In DepthDetails US Patent
TargetD(2) dopamine receptor(Homo sapiens (Human))
Indivior
US Patent
LigandPNGBDBM50154867(CHEMBL3775810 | US10273244, Example 134 | US105841...)
Affinity DataKi:  112nM. Assay description: CHO cells stably expressing human dopamine receptor type 2, long variant (hD2L), coupled to Gα16 protein (CHO-Gα16-hD2L) were seeded into b...
In DepthDetails US Patent
TargetD(2) dopamine receptor(Homo sapiens (Human))
Indivior
US Patent
LigandPNGBDBM50154867(CHEMBL3775810 | US10273244, Example 134 | US105841...)
Affinity DataKi:  112nM. Assay description: Functional Calcium Assay at hD2 recombinant receptor. CHO cells stably expressing human dopamine receptor type 2, long variant (hD2L), coupled to G&#...
In DepthDetails US Patent