BDBM50155085 CHEMBL362331::N,N-Diethyl-4-[(8-phenethyl-8-aza-bicyclo[3.2.1]oct-3-ylidene)-phenyl-methyl]-benzamide
SMILES [#6]-[#6]-[#7](-[#6]-[#6])-[#6](=O)-c1ccc(cc1)-[#6](=[#6]-1/[#6]-[#6]-2-[#6]-[#6]-[#6](-[#6]-1)-[#7]-2-[#6]-[#6]-c1ccccc1)\c1ccccc1
InChI Key InChIKey=ZJOPBPNTQRUJNM-UHFFFAOYSA-N
Data  1 KI
  Tab Delimited (TSV)   2D SDfile   Computed 3D by Vconf -m prep SDfile
Find this compound or compounds like it in BindingDB:
Activity Spreadsheet -- Enzyme Inhibition Constant Data from BindingDB
Found 1 hit for monomerid = 50155085
TargetMu-type opioid receptor(MOUSE)
Johnson And Johnson Pharmaceutical Research And Development
Curated by ChEMBL
LigandPNGBDBM50155085(CHEMBL362331 | N,N-Diethyl-4-[(8-phenethyl-8-aza-b...)
Affinity DataKi:  0.260nM. Assay description: Binding affinity against mu opioid receptor in mouse hot plate test
In DepthDetails ArticlePubMed