BDBM50156743 (S)-N-hydroxy-4-methyl-3-(4-(methyl(neopentyl)amino)-6-(pyrrolidin-3-ylamino)-1,3,5-triazin-2-ylamino)benzamide::CHEMBL225419
SMILES CN(CC(C)(C)C)c1nc(N[C@H]2CCNC2)nc(Nc2cc(ccc2C)C(=O)NO)n1
InChI Key InChIKey=AELHYFBIBMMUDF-HNNXBMFYSA-N
Data  1 IC50
  Tab Delimited (TSV)   2D SDfile   Computed 3D by Vconf -m prep SDfile
Find this compound or compounds like it in BindingDB:
Activity Spreadsheet -- Enzyme Inhibition Constant Data from BindingDB
Found 1 hit for monomerid = 50156743
TargetMitogen-activated protein kinase 14(Homo sapiens (Human))
Bristol-Myers Squibb
Curated by ChEMBL
LigandPNGBDBM50156743((S)-N-hydroxy-4-methyl-3-(4-(methyl(neopentyl)amin...)
Affinity DataIC50:  16nM. Assay description: Inhibition of human p38-alpha expressed in Escherichia coli
In DepthDetails ArticlePubMed