BDBM50156753 4-methyl-3-(4-(methyl(neopentyl)amino)-6-(4-methyl-1,4-diazepan-1-yl)-1,3,5-triazin-2-ylamino)benzoic acid::CHEMBL387153
SMILES CN(CC(C)(C)C)c1nc(Nc2cc(ccc2C)C(O)=O)nc(n1)N1CCCN(C)CC1
InChI Key InChIKey=HWYJUFZHCVVPKA-UHFFFAOYSA-N
Data  1 IC50
  Tab Delimited (TSV)   2D SDfile   Computed 3D by Vconf -m prep SDfile
Find this compound or compounds like it in BindingDB:
Activity Spreadsheet -- Enzyme Inhibition Constant Data from BindingDB
Found 1 hit for monomerid = 50156753
TargetMitogen-activated protein kinase 14(Homo sapiens (Human))
Bristol-Myers Squibb
Curated by ChEMBL
LigandPNGBDBM50156753(4-methyl-3-(4-(methyl(neopentyl)amino)-6-(4-methyl...)
Affinity DataIC50: >1.00E+3nM. Assay description: Inhibition of human p38-alpha expressed in Escherichia coli
In DepthDetails ArticlePubMed