BDBM50158295 5-Chloro-1H-indole-2-carboxylic acid {[cyclopentyl-(2,3-dihydroxy-propyl)-carbamoyl]-methyl}-amide::CHEMBL178524
SMILES OCC(O)CN(C1CCCC1)C(=O)CNC(=O)c1cc2cc(Cl)ccc2[nH]1
InChI Key InChIKey=BCDNMRLVUZRHTD-UHFFFAOYSA-N
Data  1 IC50
  Tab Delimited (TSV)   2D SDfile   Computed 3D by Vconf -m prep SDfile
Find this compound or compounds like it in BindingDB:
Activity Spreadsheet -- Enzyme Inhibition Constant Data from BindingDB
Found 1 hit for monomerid = 50158295
TargetGlycogen phosphorylase, liver form(Homo sapiens (Human))
Pfizer
Curated by ChEMBL
LigandPNGBDBM50158295(5-Chloro-1H-indole-2-carboxylic acid {[cyclopentyl...)
Affinity DataIC50:  54nM. Assay description: Inhibitory concentration against glycogen phosphorylase
In DepthDetails ArticlePubMed