BDBM50158296 5-Chloro-1H-indole-2-carboxylic acid [(cyclobutyl-methyl-carbamoyl)-methyl]-amide::CHEMBL178256
SMILES CN(C1CCC1)C(=O)CNC(=O)c1cc2cc(Cl)ccc2[nH]1
InChI Key InChIKey=SJBAGXGKRRTNNK-UHFFFAOYSA-N
Data  1 IC50
  Tab Delimited (TSV)   2D SDfile   Computed 3D by Vconf -m prep SDfile
Find this compound or compounds like it in BindingDB:
Activity Spreadsheet -- Enzyme Inhibition Constant Data from BindingDB
Found 1 hit for monomerid = 50158296
TargetGlycogen phosphorylase, liver form(Homo sapiens (Human))
Pfizer
Curated by ChEMBL
LigandPNGBDBM50158296(5-Chloro-1H-indole-2-carboxylic acid [(cyclobutyl-...)
Affinity DataIC50:  170nM. Assay description: Inhibitory concentration against glycogen phosphorylase
In DepthDetails ArticlePubMed