BDBM50158466 (4-methoxyphenyl)(2-methylbenzofuran-3-yl)methanone::CHEMBL225630
SMILES COc1ccc(cc1)C(=O)c1c(C)oc2ccccc12
InChI Key InChIKey=YHTKTSKKNRXRKB-UHFFFAOYSA-N
Data  1 KI
  Tab Delimited (TSV)   2D SDfile   Computed 3D by Vconf -m prep SDfile
Find this compound or compounds like it in BindingDB:
Activity Spreadsheet -- Enzyme Inhibition Constant Data from BindingDB
Found 1 hit for monomerid = 50158466
TargetCytochrome P450 2C19(Homo sapiens (Human))
Washington State University
Curated by ChEMBL
LigandPNGBDBM50158466((4-methoxyphenyl)(2-methylbenzofuran-3-yl)methanon...)
Affinity DataKi:  4.50E+3nM. Assay description: Inhibition of human CYP2C19
In DepthDetails ArticlePubMed