BDBM50159136 CHEMBL3786704
SMILES CCc1c([nH]c(C)c1C(C)=O)C(=O)Nc1cc(ccc1O)S(=O)(=O)Nc1ccccc1OC
InChI Key InChIKey=LASLSKWVQOJLHK-UHFFFAOYSA-N
Data  1 Kd
  Tab Delimited (TSV)   2D SDfile   Computed 3D by Vconf -m prep SDfile
Find this compound or compounds like it in BindingDB:
Activity Spreadsheet -- Enzyme Inhibition Constant Data from BindingDB
Found 1 hit for monomerid = 50159136
TargetBromodomain-containing protein 4(Homo sapiens (Human))
Albert-Ludwigs-University Of Freiburg
Curated by ChEMBL
LigandPNGBDBM50159136(CHEMBL3786704)
Affinity DataKd:  3.90E+3nM. Assay description: Binding affinity to partial length human BRD4 bromodomain 1 by isothermal titration calorimetry
In DepthDetails ArticlePubMed