BDBM50159201 2-Fluoro-N-[3-((R)-1-methyl-pyrrolidin-2-ylmethyl)-1H-indol-5-yl]-benzenesulfonamide
SMILES CN1CCCC1Cc1c[nH]c2ccc(NS(=O)(=O)c3ccccc3F)cc12
InChI Key InChIKey=HOSRSHIDGRXHBP-UHFFFAOYSA-N
Data  1 KI  1 EC50
  Tab Delimited (TSV)   2D SDfile   Computed 3D by Vconf -m prep SDfile
Find this compound or compounds like it in BindingDB:
Activity Spreadsheet -- Enzyme Inhibition Constant Data from BindingDB
Found 1 hit for monomerid = 50159201
Target5-hydroxytryptamine receptor 6(Homo sapiens (Human))
Wyeth Research
Curated by ChEMBL
LigandPNGBDBM50159201(2-Fluoro-N-[3-((R)-1-methyl-pyrrolidin-2-ylmethyl)...)
Affinity DataEC50:  1.30nM. Assay description: Effective agonist concentration in cAMP release assay in HeLa cells expressing human 5-hydroxytryptamine 6 receptor
In DepthDetails ArticlePubMed